{"text_format":"1","workbook":"xlsx","n_sheets":23,"sheets":["Header Rev Log","Instructions","Requirements","Agenda","Profile","Performance","Photos","Rapid assessment","01-11 Documentation","12-18 Process Walk","19 PCBA","20 Electrical","21 Plastic","22 Rotomold","23 Casting & Forging","24 Machining & Sheet Metal","Results","CAPA Plan","Detail Guide for Scoring","Guideline for Scoring","Aux","Aux2","Aux3"],"not_rendered":{"charts":7,"images":5,"macros":1,"external_links":5,"defined_names":72,"comments":0,"pivot_tables":0},"unopened":[],"bounds":{"document_bytes":16777216,"sheet_cells":100000,"rows_first":2000,"rows_last":500,"rows_between":2000,"halvings":0,"cell_chars":16384,"cell_head_chars":4096},"cells_cut":0,"cells_raw":0,"read":"whole","date_system":"1900"}

{"sheet":"Header Rev Log","index":0,"n_rows":14,"n_cols":14,"rows_kept":14,"cut":false,"hidden":false,"merged":[[12,2,12,6],[12,7,12,8],[12,9,12,10],[12,11,12,12],[12,13,12,14],[10,2,10,6],[10,7,10,8],[10,9,10,10],[10,11,10,12],[10,13,10,14],[8,2,8,6],[8,7,8,8],[8,9,8,10],[8,11,8,12],[8,13,8,14],[11,2,11,6],[11,7,11,8],[11,9,11,10],[11,11,11,12],[11,13,11,14],[9,2,9,6],[9,7,9,8],[9,9,9,10],[9,11,9,12],[9,13,9,14],[7,13,7,14],[2,1,2,2],[2,3,2,5],[2,6,2,10],[2,11,2,12],[2,13,2,14],[3,0,4,2],[3,3,4,10],[3,11,3,12],[3,13,3,14],[4,13,4,14],[7,2,7,6],[7,7,7,8],[7,9,7,10],[7,11,7,12],[1,13,1,14],[4,11,4,12],[0,1,0,2],[0,3,0,5],[0,6,0,10],[0,11,0,12],[0,13,0,14],[1,1,1,2],[1,3,1,5],[1,6,1,10],[1,11,1,12],[13,2,13,6],[13,7,13,8],[13,9,13,10],[13,11,13,12],[13,13,13,14]]}
["Author:","Peter Dudas",null,"Approved (if required): ",null,null,"Akos Takacs",null,null,null,null,"Orig.released date:",null,"29.07.2015"]
["Function:","Supplier Quality Engineering",null,"Valid for – if other than resp. function:",null,null,"Nilfisk ",null,null,null,null,"DocNumber:",null,"QMS-2-SQE0063"]
["Language:","English",null,"Document Type:",null,null,"Template",null,null,null,null,"Rev.Number:",null,6]
[null,null,null,"Supplier Assessment",null,null,null,null,null,null,null,"Effective date:",null,"2023-11-10"]
[null,null,null,null,null,null,null,null,null,null,null,"Number of sheets:",null,18]
[]
{"$rows_left_out":9}
{"sheet":"Instructions","index":1,"n_rows":58,"n_cols":10,"rows_kept":58,"cut":false,"hidden":false,"merged":[[20,5,20,8],[21,5,21,8],[1,4,1,7],[2,4,2,7],[3,4,3,7],[5,8,5,9],[17,5,17,8],[18,5,18,8],[1,1,1,3],[2,1,2,3],[3,1,3,3],[51,2,51,4],[54,2,54,4],[4,4,5,7],[4,1,5,3],[7,1,7,9],[22,5,22,8],[17,3,17,4],[18,3,18,4],[19,3,19,4],[20,3,20,4],[21,3,21,4],[22,3,22,4],[19,5,19,8]]}
[]
[null,"Author: Peter Dudas",null,null,"Approved (if required): Akos Takacs",null,null,null,"Original released date:","29.07.2015"]
[null,"Function: Supplier Quality Engineering",null,null,"Valid for – if other than resp. function :  Nilfisk",null,null,null,"Doc.Number:","QMS-2-SQE0063"]
[null,"Language: English",null,null,"Document Type: Template",null,null,null,"Rev.Number:","6"]
[null,null,null,null,"Supplier Assessment",null,null,null,"Effective date:","2023-11-10"]
[null,null,null,null,null,null,null,null,"Pages:18"]
{"$rows_left_out":53}
{"sheet":"Requirements","index":2,"n_rows":40,"n_cols":10,"rows_kept":40,"cut":false,"hidden":false,"merged":[[26,3,26,4],[27,3,27,4],[27,6,27,7],[24,1,24,2],[24,3,24,4],[25,1,25,2],[25,3,25,4],[14,1,14,2],[14,3,15,4],[14,6,14,7],[14,8,14,9],[15,8,15,9],[17,1,17,9],[19,1,19,2],[19,3,19,4],[22,3,22,4],[20,1,20,2],[20,3,20,4],[21,3,21,4],[20,6,20,8],[21,6,21,8],[22,6,22,8],[12,1,12,2],[12,3,12,4],[12,6,12,7],[12,8,12,9],[13,6,13,7],[13,8,13,9],[13,3,13,4],[40,1,40,9],[7,6,7,7],[3,1,3,9],[5,1,5,2],[5,3,5,4],[5,8,5,9],[7,1,7,2],[6,8,6,9],[5,6,5,7],[6,6,6,7],[6,3,6,4],[7,3,8,4],[7,8,7,9],[29,1,29,9],[8,8,8,9],[10,1,10,9]]}
[]
[]
[]
[null,"Supplier Information (from which company Nilfisk is / will be buying from)"]
[]
[null,"Company Name:",null,null,null,null,"Contact name:"]
{"$rows_left_out":35}
{"sheet":"Agenda","index":3,"n_rows":8,"n_cols":6,"rows_kept":8,"cut":false,"hidden":false,"merged":[[3,1,3,5],[5,2,5,3]]}
[]
[]
[]
[null,"On-site visit agenda"]
[]
[null,"Date",{"$f":"IF(Requirements!J23=\"\",\"\",Requirements!J23)","v":""}]
{"$rows_left_out":3}
{"sheet":"Profile","index":4,"n_rows":52,"n_cols":8,"rows_kept":52,"cut":false,"hidden":false,"merged":[[3,1,3,2]]}
[]
[]
[]
[null,"Business profile"]
[]
[null,"The business profile is filled in by:",1]
{"$rows_left_out":47}
{"sheet":"Performance","index":5,"n_rows":18,"n_cols":5,"rows_kept":18,"cut":false,"hidden":false,"merged":[[3,1,3,4]]}
[]
[]
[]
[null,"Performance results"]
[]
[null,"Please fill this with the overall performance of the company, for all customers, last 12 months"]
{"$rows_left_out":13}
{"sheet":"Photos","index":6,"n_rows":4,"n_cols":2,"rows_kept":4,"cut":false,"hidden":false,"merged":[[3,1,3,6]]}
[]
[]
[]
[null,"Photos taken during the visit"]

{"sheet":"Rapid assessment","index":7,"n_rows":29,"n_cols":6,"rows_kept":29,"cut":false,"hidden":false,"merged":[[3,1,3,5],[28,1,28,5],[14,2,14,3],[15,2,15,3],[9,2,9,3],[10,2,10,3],[11,2,11,3],[12,2,12,3],[24,2,24,3],[8,2,8,3],[26,2,26,3],[20,2,20,3],[21,2,21,3],[25,2,25,3],[29,1,29,5],[13,2,13,3],[22,2,22,3],[23,2,23,3],[16,2,16,3],[17,2,17,3],[18,2,18,3],[19,2,19,3]]}
[]
[]
[]
[null,"Rapid  assessment"]
[]
[null,null,"Filled in by:",1]
{"$rows_left_out":24}
{"sheet":"01-11 Documentation","index":8,"n_rows":91,"n_cols":6,"rows_kept":91,"cut":false,"hidden":false,"merged":[]}
[]
[null,null,null,{"$f":"SUM(D6:D10,D14:D18,D22:D24,D28:D29,D33:D38,D42:D44,D48:D52,D56:D58,D63:D73,D77:D81,D85:D90)","v":0},{"$f":"SUM(E6:E10,E14:E18,E22:E24,E28:E29,E33:E38,E42:E44,E48:E52,E56:E58,E63:E73,E77:E81,E85:E90)","v":162}]
[null,null,null,{"$f":"COUNT(D6:D10,D14:D18,D22:D24,D28:D29,D33:D38,D42:D44,D48:D52,D56:D58,D63:D73,D77:D81,D85:D90)","v":0},{"$f":"COUNT(E6:E10,E14:E18,E22:E24,E28:E29,E33:E38,E42:E44,E48:E52,E56:E58,E63:E73,E77:E81,E85:E90)","v":54}]
[null,"Nr","Area / Elements","Supplier \nscore","Nilfisk\nscore","Observations"]
[null,"1","Management Responsibility"]
[null,"1.1","Has management defined and documented policies, objectives and commitments to quality?  ",null,3]
{"$rows_left_out":86}
{"sheet":"12-18 Process Walk","index":9,"n_rows":76,"n_cols":6,"rows_kept":76,"cut":false,"hidden":false,"merged":[[12,3,12,5]]}
[]
[null,null,null,{"$f":"SUM(D6:D9,D14:D24,D28:D35,D39:D49,D53:D60,D64:D67,D71:D75)","v":0},{"$f":"SUM(E6:E9,E14:E24,E28:E35,E39:E49,E53:E60,E64:E67,E71:E75)","v":153}]
[null,null,null,{"$f":"COUNT(D6:D9,D14:D24,D28:D35,D39:D49,D53:D60,D64:D67,D71:D75)","v":0},{"$f":"COUNT(E6:E9,E14:E24,E28:E35,E39:E49,E53:E60,E64:E67,E71:E75)","v":51}]
[null,"Nr","Area / Elements","Supplier \nscore","Nilfisk\nscore","Observations"]
[null,"12","Product Identification and Traceability"]
[null,"12.1","Does the supplier have procedures for identifying products through all stages of design, if applicable, and manufacture? ",null,3]
{"$rows_left_out":71}
{"sheet":"19 PCBA","index":10,"n_rows":44,"n_cols":6,"rows_kept":44,"cut":false,"hidden":true,"merged":[]}
[]
[null,null,null,{"$f":"SUM(D6:D34)","v":0},{"$f":"SUM(E6:E34)","v":0}]
[null,null,null,{"$f":"COUNT(D6:D34)","v":0},{"$f":"COUNT(E6:E34)","v":0}]
[null,"Nr","Area / Elements","Supplier \nscore","Nilfisk\nscore","Observations"]
[null,"19","PCB Assembly"]
[null,"19.1","Is the supplier operating with ESD (electrostatic discharge) controls in place? "]
{"$rows_left_out":39}
{"sheet":"20 Electrical","index":11,"n_rows":25,"n_cols":6,"rows_kept":25,"cut":false,"hidden":true,"merged":[]}
[]
[null,null,null,{"$f":"SUM(D6:D22)","v":0},{"$f":"SUM(E6:E22)","v":0}]
[null,null,null,{"$f":"COUNT(D6:D22)","v":0},{"$f":"COUNT(E6:E22)","v":0}]
[null,"Nr","Area / Elements","Supplier \nscore","Nilfisk\nscore","Observations"]
[null,"20","Electrical assembly"]
[null,"20.1","Does the supplier have a process for final testing, which specifies how many times the products can be re-tested?"]
{"$rows_left_out":20}
{"sheet":"21 Plastic","index":12,"n_rows":29,"n_cols":6,"rows_kept":29,"cut":false,"hidden":true,"merged":[]}
[]
[null,null,null,{"$f":"SUM(D6:D26)","v":0},{"$f":"SUM(E6:E26)","v":0}]
[null,null,null,{"$f":"COUNT(D6:D26)","v":0},{"$f":"COUNT(E6:E26)","v":0}]
[null,"Nr","Area / Elements","Supplier \nscore","Nilfisk\nscore","Observations"]
[null,"21","Plastics Injection Molding"]
[null,"21.1","Does the process run according to the specified process parameters?"]
{"$rows_left_out":24}
{"sheet":"22 Rotomold","index":13,"n_rows":33,"n_cols":6,"rows_kept":33,"cut":false,"hidden":true,"merged":[]}
[]
[null,null,null,{"$f":"SUM(D6:D30)","v":0},{"$f":"SUM(E6:E30)","v":75}]
[null,null,null,{"$f":"COUNT($D6:$D30)","v":0},{"$f":"COUNT($E6:$E30)","v":25}]
[null,"Nr","Area / Elements","Supplier \nscore","Nilfisk\nscore","Observations"]
[null,"22","Rotational Molding"]
[null,"22.1","Is the raw material (powder, pigment) controlled and kept clean during receiving and transport to the molding machine?",null,3]
{"$rows_left_out":28}
{"sheet":"23 Casting & Forging","index":14,"n_rows":26,"n_cols":6,"rows_kept":26,"cut":false,"hidden":true,"merged":[]}
[]
[null,null,null,{"$f":"SUM(D6:D20)","v":0},{"$f":"SUM(E6:E20)","v":0}]
[null,null,null,{"$f":"COUNT(D6:D20)","v":0},{"$f":"COUNT(E6:E20)","v":0}]
[null,"Nr","Area / Elements","Supplier \nscore","Nilfisk\nscore","Observations"]
[null,"23","Casting / Forging"]
[null,"23.1","Is casting/forging recipe available and properly detailed? "]
{"$rows_left_out":21}
{"sheet":"24 Machining & Sheet Metal","index":15,"n_rows":22,"n_cols":6,"rows_kept":22,"cut":false,"hidden":true,"merged":[]}
[]
[null,null,null,{"$f":" SUM(D6:D19)","v":0},{"$f":" SUM(E6:E19)","v":0}]
[null,null,null,{"$f":" COUNT(D6:D19)","v":0},{"$f":" COUNT(E6:E19)","v":0}]
[null,"Nr","Area / Elements","Supplier \nscore","Nilfisk\nscore","Observations"]
[null,"24","Machining / Sheet Metal Fabrication"]
[null,"24.1","Is there a defined process for machine setup?"]
{"$rows_left_out":17}
{"sheet":"Results","index":16,"n_rows":37,"n_cols":10,"rows_kept":37,"cut":false,"hidden":false,"merged":[[37,1,40,9],[36,1,36,9],[3,1,3,9],[33,1,33,3],[33,6,33,8],[34,7,34,9]]}
[]
[]
[]
[null,"Assessment results"]
[]
[]
{"$rows_left_out":32}
{"sheet":"CAPA Plan","index":17,"n_rows":139,"n_cols":11,"rows_kept":139,"cut":false,"hidden":false,"merged":[[9,1,12,1],[136,2,136,9],[3,1,3,9],[11,3,12,3]]}
[]
[]
[]
[null,"Action Plan"]
[]
[null,"Created:","2021-12-06",null,null,null,null,null,null,null,{"$f":"TODAY()","v":45544}]
{"$rows_left_out":134}
{"sheet":"Detail Guide for Scoring","index":18,"n_rows":304,"n_cols":8,"rows_kept":304,"cut":false,"hidden":false,"merged":[[288,1,288,7],[198,1,198,7],[218,1,218,7],[270,1,270,7],[1,1,1,8],[2,1,2,7],[10,1,10,7],[18,1,18,7],[21,1,24,1],[21,2,24,2],[21,3,24,3],[21,4,24,4],[21,5,24,5],[21,6,24,6],[21,7,24,7],[94,1,94,7],[27,1,27,7],[115,1,115,7],[32,1,32,7],[62,1,62,7],[41,1,41,7],[166,1,166,7],[242,1,242,7],[151,1,151,7],[48,1,48,7],[56,1,56,7],[158,1,158,7],[77,1,77,7],[85,1,85,7],[101,1,101,7],[126,1,126,7],[140,1,140,7]]}
[]
[null,"ASSESSMENT ELEMENTS"]
[null,"1.   Management Responsibility"]
[null,null,"QUESTION/SCORE",0,1,2,3,"Evidence and Records to look for:"]
[null,"1.1","Has management defined and documented its policies, objectives and commitments to quality?  ","No policy, quality objectives or commitments to quality.","Supplier has some of the following:  quality policy, quality objectives, quality manual, procedures and records with missing documentation or execution.","Supplier has  quality policy, quality objectives, quality manual, procedures and records with some missing documentation.","There is a documented quality policy and quality objectives, quality manual, procedures and records -- no missing documentation.  ","Verify there is a clear understandable quality policy, quality objectives, quality manual, procedures and records, review records."]
[null,"1.2","Is there an appointed a management representative responsible for ensuring compliance with quality requirements? ","There is no management representative for the quality management system.","There is a quality engineer, technician or other who does represent quality in day-to-day operations but does not report to top management, does not ensure the quality management system is implemented and maintained, and does not ensure customer requirements are promoted throughout the organization.  Missing records or evidence of execution.","There is a quality manager who  performs most of the following, but not all:  reports to top management; ensures quality management system is established, implemented and maintained, and ensures customer requirements are promoted throughout the organization.  Some records or evidence of actions are available.","There is a management representative for the quality system who performs the following:  reports to top management; ensures quality management system is established, implemented and maintained, and ensures customer requirements are promoted throughout the organization.  Records of actions are available.","Quality procedure(s) indicate who the quality management representative is and who approves quality documents, review quality meeting minutes, performance including internal and external measurements and goals, any audits."]
{"$rows_left_out":299}
{"sheet":"Guideline for Scoring","index":19,"n_rows":13,"n_cols":14,"rows_kept":13,"cut":false,"hidden":false,"merged":[[4,1,4,8],[0,0,0,8],[0,11,0,13],[1,1,1,8],[2,1,2,8],[3,1,3,8],[6,0,6,9],[6,11,6,13],[8,0,8,9],[9,11,9,13],[10,0,10,9]]}
["Assessment Guideline for Scoring",null,null,null,null,null,null,null,null,"Score",null,"Assessment Scoring and Approvals  -- Existing / Re-opened Suppliers"]
["Excellent","The supplier has processes and management systems which fulfill or exceed Nilfisk requirements with full documentation and no missing requirements. ",null,null,null,null,null,null,null,3,null,"Scoring ","Approval","Actions"]
["Very Good","Opportunity for Improvement:\nThe supplier has processes and management systems which fulfill Nilfisk basic requirements with substantial documentation although may be some improvements identified.",null,null,null,null,null,null,null,2,null,"100 - 86  ","Approved","In case of the total score is between 86-100 and there is no question scored with 0 or 1 than Approved status can be granted.\nIn case of the total score is between 86-100 but any question scored 0 or 1, then corrective actions needs to be submitted within ten (10) working days before Approved status granted."]
["Conditionally Acceptable ","\nMinor finding:\nThe supplier has minimal processes and management systems in place to fulfil Nilfisk basic requirements with limited documentation or execution. ",null,null,null,null,null,null,null,1,null,"85 - 70 \n\n","Conditionally Approved","Corrective actions for findings with Score 0 or 1 shall be developed and submitted within ten (10) working days.  \nThe supplier shall strive to implement corrective actions within forty-five (45) working days or as agreed with Nilfisk. \nThe effectiveness of the corractive actions shall be verified by Nilfisk.\nThe supplier may be placed on New Business Hold status If above requirements not met. "]
["Not acceptable","MAJOR finding:\nThe supplier is not fulfilling Nilfisk requirements with any evidence of execution or understanding. ",null,null,null,null,null,null,null,0,null,"69 and below","Not Approved","Corrective actions for findings with a Score 0 or 1 shall be developed and submitted within ten (10) working days. Supplier shall implement immediate corrective actions within thirty (30) working days and participate in a Supplier Quality Development Plan as defined by Nilfisk. \nThe supplier shall strive to implement final corrective actions within sixty (60) working days or as agreed with Nilfisk. \nThe effectiveness of the corrective actions shall be verified by Nilfisk. \nThe supplier should be placed on New Business Hold status, till corrective actions are implemented and verified by Nilfisk. \n "]
[]
{"$rows_left_out":8}
{"sheet":"Aux","index":20,"n_rows":36,"n_cols":4,"rows_kept":36,"cut":false,"hidden":true,"merged":[]}
[]
[null,0]
[null,1]
[null,2]
[null,3]
[null,"N/A"]
{"$rows_left_out":31}
{"sheet":"Aux2","index":21,"n_rows":227,"n_cols":6,"rows_kept":227,"cut":false,"hidden":true,"merged":[]}
["nr","issue_date","Question & Observation","Nilfisk score","element","observation"]
[{"$f":"'01-11 Documentation'!B6","v":"1.1"},{"$f":"TODAY()","v":"2024-09-09"},{"$f":"E2 & IF(F2=0,\"\",CHAR(10) & CHAR(10) & F2)","v":"Has management defined and documented policies, objectives and commitments to quality?  "},{"$f":"IF('01-11 Documentation'!E6=\"\",\"\",'01-11 Documentation'!E6)","v":3},{"$f":"'01-11 Documentation'!C6","v":"Has management defined and documented policies, objectives and commitments to quality?  "},{"$f":"'01-11 Documentation'!F6","v":0}]
[{"$f":"'01-11 Documentation'!B7","v":"1.2"},{"$f":"TODAY()","v":"2024-09-09"},{"$f":"E3 & IF(F3=0,\"\",CHAR(10) & CHAR(10) & F3)","v":"Is there an appointed responsible person for ensuring compliance with quality requirements? "},{"$f":"IF('01-11 Documentation'!E7=\"\",\"\",'01-11 Documentation'!E7)","v":3},{"$f":"'01-11 Documentation'!C7","v":"Is there an appointed responsible person for ensuring compliance with quality requirements? "},{"$f":"'01-11 Documentation'!F7","v":0}]
[{"$f":"'01-11 Documentation'!B8","v":"1.3"},"2024-09-09","Is there a defined process in place for performing contract review (review of Nilfisk Purchase Order)? ",{"$f":"IF('01-11 Documentation'!E8=\"\",\"\",'01-11 Documentation'!E8)","v":3},{"$f":"'01-11 Documentation'!C8","v":"Is there a defined process in place for performing contract review (review of Nilfisk Purchase Order)? "},{"$f":"'01-11 Documentation'!F8","v":0}]
[{"$f":"'01-11 Documentation'!B9","v":"1.4"},"2024-09-09",{"$f":"E5 & IF(F5=0,\"\",CHAR(10) & CHAR(10) & F5)","v":"Is there a contingency plan defined to assure business continuity?"},{"$f":"IF('01-11 Documentation'!E9=\"\",\"\",'01-11 Documentation'!E9)","v":3},{"$f":"'01-11 Documentation'!C9","v":"Is there a contingency plan defined to assure business continuity?"},{"$f":"'01-11 Documentation'!F9","v":0}]
[{"$f":"'01-11 Documentation'!B10","v":"1.5"},"2024-09-09","Is there is a defined process in place to review technical specification requirement and manufacturing capability?",{"$f":"IF('01-11 Documentation'!E10=\"\",\"\",'01-11 Documentation'!E10)","v":3},{"$f":"'01-11 Documentation'!C10","v":"Is there is a defined process in place to review technical specification requirement and manufacturing capability?"},{"$f":"'01-11 Documentation'!F10","v":0}]
{"$rows_left_out":222}
{"sheet":"Aux3","index":22,"n_rows":207,"n_cols":6,"rows_kept":207,"cut":false,"hidden":true,"merged":[]}
["nr","issue_date","Question & Observation","Nilfisk score","element","observation"]
[{"$f":"'01-11 Documentation'!B6","v":"1.1"},{"$f":"TODAY()","v":"2024-09-09"},{"$f":"E2 & IF(F2=0,\"\",CHAR(10) & CHAR(10) & F2)","v":"Has management defined and documented policies, objectives and commitments to quality?  "},{"$f":"IF('01-11 Documentation'!E6=\"\",\"\",'01-11 Documentation'!E6)","v":3},{"$f":"'01-11 Documentation'!C6","v":"Has management defined and documented policies, objectives and commitments to quality?  "},{"$f":"'01-11 Documentation'!F6","v":0}]
[{"$f":"'01-11 Documentation'!B7","v":"1.2"},{"$f":"TODAY()","v":"2024-09-09"},{"$f":"E3 & IF(F3=0,\"\",CHAR(10) & CHAR(10) & F3)","v":"Is there an appointed responsible person for ensuring compliance with quality requirements? "},{"$f":"IF('01-11 Documentation'!E7=\"\",\"\",'01-11 Documentation'!E7)","v":3},{"$f":"'01-11 Documentation'!C7","v":"Is there an appointed responsible person for ensuring compliance with quality requirements? "},{"$f":"'01-11 Documentation'!F7","v":0}]
[{"$f":"'01-11 Documentation'!B8","v":"1.3"},"2024-09-09","Is there a defined process in place for performing contract review (review of Nilfisk Purchase Order)? ",{"$f":"IF('01-11 Documentation'!E8=\"\",\"\",'01-11 Documentation'!E8)","v":3},{"$f":"'01-11 Documentation'!C8","v":"Is there a defined process in place for performing contract review (review of Nilfisk Purchase Order)? "},{"$f":"'01-11 Documentation'!F8","v":0}]
[{"$f":"'01-11 Documentation'!B9","v":"1.4"},"2024-09-09",{"$f":"E5 & IF(F5=0,\"\",CHAR(10) & CHAR(10) & F5)","v":"Is there a contingency plan defined to assure business continuity?"},{"$f":"IF('01-11 Documentation'!E9=\"\",\"\",'01-11 Documentation'!E9)","v":3},{"$f":"'01-11 Documentation'!C9","v":"Is there a contingency plan defined to assure business continuity?"},{"$f":"'01-11 Documentation'!F9","v":0}]
[{"$f":"'01-11 Documentation'!B10","v":"1.5"},"2024-09-09","Is there is a defined process in place to review technical specification requirement and manufacturing capability?",{"$f":"IF('01-11 Documentation'!E10=\"\",\"\",'01-11 Documentation'!E10)","v":3},{"$f":"'01-11 Documentation'!C10","v":"Is there is a defined process in place to review technical specification requirement and manufacturing capability?"},{"$f":"'01-11 Documentation'!F10","v":0}]
{"$rows_left_out":201}